Target
Tumor necrosis factor
Ligand
BDBM50312
Substrate
Meas. Tech.
HTS dose response assay for identification of inhibitors of TNFa-specific NF-kB induction
IC50
666.25±116 nM
Citation
 PubChem, PC HTS dose response assay for identification of inhibitors of TNFa-specific NF-kB induction PubChem Bioassay (2010)[AID] 
Target
Name:
Tumor necrosis factor
Synonyms:
Cachectin TNF-a TNFA TNFSF2 Tumor necrosis factor (TNFa) Tumor necrosis factor ligand superfamily member 2 Tumor necrosis factor, soluble form | tumor necrosis factor alpha
Type:
Enzyme
Mol. Mass.:
25645.11
Organism:
Homo sapiens (Human)
Description:
P01375
Residue:
233
  
Inhibitor
Name:
BDBM50312
Synonyms:
2-[(4,6-difluoro-1,3-benzothiazol-2-yl)amino]-1,3-benzothiazole-6-carboxylic acid methyl ester SMR000236235 methyl 2-[(4,6-difluoro-1,3-benzothiazol-2-yl)amino]-1,3-benzothiazole-6-carboxylate | methyl 2-[[4,6-bis(fluoranyl)-1,3-benzothiazol-2-yl]amino]-1,3-benzothiazole-6-carboxylate
Type:
Small organic molecule
Emp. Form.:
C16H9F2N3O2S2
Mol. Mass.:
377.388
SMILES:
COC(=O)c1ccc2nc(Nc3nc4c(F)cc(F)cc4s3)sc2c1
: