Target
Amyloid-beta A4 precursor protein-binding family A member 1
Ligand
BDBM65749
Substrate
Meas. Tech.
SAR analysis of small molecule inhibitors of Mint-PDZ and N-type Ca2+ channel carboxyl-terminal peptide association using HTRF
IC50
>56800±n/a nM
Citation
 PubChem, PC SAR analysis of small molecule inhibitors of Mint-PDZ and N-type Ca2+ channel carboxyl-terminal peptide association using HTRF PubChem Bioassay (2010)[AID] 
Target
Name:
Amyloid-beta A4 precursor protein-binding family A member 1
Synonyms:
APBA1_RAT Mint1 neuronal munc18-1 binding protein
Type:
Enzyme Catalytic Domain
Mol. Mass.:
92603.32
Organism:
Rattus norvegicus
Description:
gi_2625023
Residue:
839
  
Inhibitor
Name:
BDBM65749
Synonyms:
2-(2-furanyl)-4-quinolinecarboxylic acid [2-oxo-2-[(phenylmethyl)amino]ethyl] ester MLS-0104272.0001 [2-oxidanylidene-2-[(phenylmethyl)amino]ethyl] 2-(furan-2-yl)quinoline-4-carboxylate | cid_2335665
Type:
Small organic molecule
Emp. Form.:
C23H18N2O4
Mol. Mass.:
386.4
SMILES:
O=C(COC(=O)c1cc(nc2ccccc12)-c1ccco1)NCc1ccccc1
: