Target
Amyloid-beta A4 precursor protein-binding family A member 1
Ligand
BDBM65753
Substrate
Meas. Tech.
SAR analysis of small molecule inhibitors of Mint-PDZ and N-type Ca2+ channel carboxyl-terminal peptide association using HTRF
IC50
23400±n/a nM
Citation
 PubChem, PC SAR analysis of small molecule inhibitors of Mint-PDZ and N-type Ca2+ channel carboxyl-terminal peptide association using HTRF PubChem Bioassay (2010)[AID] 
Target
Name:
Amyloid-beta A4 precursor protein-binding family A member 1
Synonyms:
APBA1_RAT Mint1 neuronal munc18-1 binding protein
Type:
Enzyme Catalytic Domain
Mol. Mass.:
92603.32
Organism:
Rattus norvegicus
Description:
gi_2625023
Residue:
839
  
Inhibitor
Name:
BDBM65753
Synonyms:
2-(2-furanyl)-4-quinolinecarboxylic acid [2-[2-(3,4-dimethoxyphenyl)ethylamino]-2-oxoethyl] ester MLS-0315866.0001 [2-[2-(3,4-dimethoxyphenyl)ethylamino]-2-oxoethyl] 2-(furan-2-yl)quinoline-4-carboxylate | cid_2384768
Type:
Small organic molecule
Emp. Form.:
C26H24N2O6
Mol. Mass.:
460.4786
SMILES:
COc1ccc(CCNC(=O)COC(=O)c2cc(nc3ccccc23)-c2ccco2)cc1OC
: