Target
Amyloid-beta A4 precursor protein-binding family A member 1
Ligand
BDBM54740
Substrate
Meas. Tech.
SAR analysis of small molecule inhibitors of Mint-PDZ and N-type Ca2+ channel carboxyl-terminal peptide association using HTRF
IC50
3340±n/a nM
Citation
 PubChem, PC SAR analysis of small molecule inhibitors of Mint-PDZ and N-type Ca2+ channel carboxyl-terminal peptide association using HTRF PubChem Bioassay (2010)[AID] 
Target
Name:
Amyloid-beta A4 precursor protein-binding family A member 1
Synonyms:
APBA1_RAT Mint1 neuronal munc18-1 binding protein
Type:
Enzyme Catalytic Domain
Mol. Mass.:
92603.32
Organism:
Rattus norvegicus
Description:
gi_2625023
Residue:
839
  
Inhibitor
Name:
BDBM54740
Synonyms:
(E)-3-(5-methyl-2-furanyl)-N-[(4-sulfamoylphenyl)methyl]-2-propenamide (E)-3-(5-methylfuran-2-yl)-N-[(4-sulfamoylphenyl)methyl]prop-2-enamide N-[4-(aminosulfonyl)benzyl]-3-(5-methyl-2-furyl)acrylamide cid_897117
Type:
Small organic molecule
Emp. Form.:
C15H16N2O4S
Mol. Mass.:
320.364
SMILES:
Cc1ccc(\C=C\C(=O)NCc2ccc(cc2)S(N)(=O)=O)o1
: