Target
Amyloid-beta A4 precursor protein-binding family A member 1
Ligand
BDBM65795
Substrate
Meas. Tech.
SAR analysis of small molecule inhibitors of Mint-PDZ and N-type Ca2+ channel carboxyl-terminal peptide association using HTRF
IC50
>56800±n/a nM
Citation
 PubChem, PC SAR analysis of small molecule inhibitors of Mint-PDZ and N-type Ca2+ channel carboxyl-terminal peptide association using HTRF PubChem Bioassay (2010)[AID] 
Target
Name:
Amyloid-beta A4 precursor protein-binding family A member 1
Synonyms:
APBA1_RAT Mint1 neuronal munc18-1 binding protein
Type:
Enzyme Catalytic Domain
Mol. Mass.:
92603.32
Organism:
Rattus norvegicus
Description:
gi_2625023
Residue:
839
  
Inhibitor
Name:
BDBM65795
Synonyms:
VU0409721-1 [2-(2-furyl)-4-quinolyl]-(3-phenylpiperidino)methanone cid_44602311
Type:
Small organic molecule
Emp. Form.:
C25H22N2O2
Mol. Mass.:
382.4544
SMILES:
O=C(N1CCCC(C1)c1ccccc1)c1cc(nc2ccccc12)-c1ccco1
: