Target
Amyloid-beta A4 precursor protein-binding family A member 1
Ligand
BDBM65802
Substrate
Meas. Tech.
SAR analysis of small molecule inhibitors of Mint-PDZ and N-type Ca2+ channel carboxyl-terminal peptide association using HTRF
IC50
10700±n/a nM
Citation
 PubChem, PC SAR analysis of small molecule inhibitors of Mint-PDZ and N-type Ca2+ channel carboxyl-terminal peptide association using HTRF PubChem Bioassay (2010)[AID] 
Target
Name:
Amyloid-beta A4 precursor protein-binding family A member 1
Synonyms:
APBA1_RAT Mint1 neuronal munc18-1 binding protein
Type:
Enzyme Catalytic Domain
Mol. Mass.:
92603.32
Organism:
Rattus norvegicus
Description:
gi_2625023
Residue:
839
  
Inhibitor
Name:
BDBM65802
Synonyms:
2-(4-fluorophenyl)-4,7-dimethyl-3a,7a-dihydro-octahydro-1H-4,7-epoxyisoindole-1,3-dione MLS-0435568.0001 | cid_2860069
Type:
Small organic molecule
Emp. Form.:
C16H14FNO3
Mol. Mass.:
287.2857
SMILES:
CC12OC(C)(C=C1)c1c(O)n(c(O)c21)-c1ccc(F)cc1
: