Target
Kappa-type opioid receptor
Ligand
BDBM65818
Substrate
Meas. Tech.
SAR analysis of Antagonists of the Kappa Opioid Receptor (KOR) using an Image-Based Assay - Set 2
IC50
>32000±n/a nM
Citation
 PubChem, PC SAR analysis of Antagonists of the Kappa Opioid Receptor (KOR) using an Image-Based Assay - Set 2 PubChem Bioassay (2010)[AID] 
Target
Name:
Kappa-type opioid receptor
Synonyms:
K-OR-1 Kappa-opioid receptor (KOR) Kappa-type opioid receptor (KOR) OPIATE Kappa OPRK1 kappa opioid receptor (KOR)
Type:
G Protein-Coupled Receptor (GPCR)
Mol. Mass.:
42648.76
Organism:
Homo sapiens (Human)
Description:
P41145
Residue:
380
  
Inhibitor
Name:
BDBM65818
Synonyms:
2-[4-(2-furanylmethyl)-5-[(4-methoxyphenyl)methylthio]-1,2,4-triazol-3-yl]pyridine 2-[4-(furan-2-ylmethyl)-5-[(4-methoxyphenyl)methylsulfanyl]-1,2,4-triazol-3-yl]pyridine KUC103894N | cid_2562032
Type:
Small organic molecule
Emp. Form.:
C20H18N4O2S
Mol. Mass.:
378.448
SMILES:
COc1ccc(CSc2nnc(-c3ccccn3)n2Cc2ccco2)cc1
: