Target
Kappa-type opioid receptor
Ligand
BDBM65830
Substrate
Meas. Tech.
SAR analysis of Agonists of the Kappa Opioid Receptor (KOR) using an Image-Based Assay - Set 2
EC50
>32000±n/a nM
Citation
 PubChem, PC SAR analysis of Agonists of the Kappa Opioid Receptor (KOR) using an Image-Based Assay - Set 2 PubChem Bioassay (2010)[AID] 
Target
Name:
Kappa-type opioid receptor
Synonyms:
K-OR-1 Kappa-opioid receptor (KOR) Kappa-type opioid receptor (KOR) OPIATE Kappa OPRK1 kappa opioid receptor (KOR)
Type:
G Protein-Coupled Receptor (GPCR)
Mol. Mass.:
42648.76
Organism:
Homo sapiens (Human)
Description:
P41145
Residue:
380
  
Inhibitor
Name:
BDBM65830
Synonyms:
4-[[(4-methylphenyl)sulfonylamino]methyl]-N-[3-[(phenylmethyl)-propan-2-yl-amino]propyl]benzamide KSC-5-249 N-[3-[benzyl(isopropyl)amino]propyl]-4-[(tosylamino)methyl]benzamide cid_20968607
Type:
Small organic molecule
Emp. Form.:
C28H35N3O3S
Mol. Mass.:
493.661
SMILES:
CC(C)N(CCCNC(=O)c1ccc(CNS(=O)(=O)c2ccc(C)cc2)cc1)Cc1ccccc1
: