Target
Kappa-type opioid receptor
Ligand
BDBM65816
Substrate
Meas. Tech.
SAR analysis of small molecule agonists of the kappa opioid receptor via a luminescent beta-arrestin assay - Set 2
EC50
80.2±n/a nM
Citation
 PubChem, PC SAR analysis of small molecule agonists of the kappa opioid receptor via a luminescent beta-arrestin assay - Set 2 PubChem Bioassay (2010)[AID] 
Target
Name:
Kappa-type opioid receptor
Synonyms:
K-OR-1 Kappa-opioid receptor (KOR) Kappa-type opioid receptor (KOR) OPIATE Kappa OPRK1 kappa opioid receptor (KOR)
Type:
G Protein-Coupled Receptor (GPCR)
Mol. Mass.:
42648.76
Organism:
Homo sapiens (Human)
Description:
P41145
Residue:
380
  
Inhibitor
Name:
BDBM65816
Synonyms:
KSC-5-196 N-[(1R)-1-[(4-bromophenyl)carbamoyl]-1-methyl-propyl]-N-(2-furfuryl)picolinamide N-[(2R)-1-(4-bromoanilino)-2-methyl-1-oxobutan-2-yl]-N-(furan-2-ylmethyl)pyridine-2-carboxamide cid_44543531
Type:
Small organic molecule
Emp. Form.:
C22H22BrN3O3
Mol. Mass.:
456.332
SMILES:
CC[C@@](C)(N(Cc1ccco1)C(=O)c1ccccn1)C(=O)Nc1ccc(Br)cc1
: