Target
Kappa-type opioid receptor
Ligand
BDBM65831
Substrate
Meas. Tech.
SAR analysis of small molecule agonists of the kappa opioid receptor via a luminescent beta-arrestin assay - Set 2
EC50
4970±n/a nM
Citation
 PubChem, PC SAR analysis of small molecule agonists of the kappa opioid receptor via a luminescent beta-arrestin assay - Set 2 PubChem Bioassay (2010)[AID] 
Target
Name:
Kappa-type opioid receptor
Synonyms:
K-OR-1 Kappa-opioid receptor (KOR) Kappa-type opioid receptor (KOR) OPIATE Kappa OPRK1 kappa opioid receptor (KOR)
Type:
G Protein-Coupled Receptor (GPCR)
Mol. Mass.:
42648.76
Organism:
Homo sapiens (Human)
Description:
P41145
Residue:
380
  
Inhibitor
Name:
BDBM65831
Synonyms:
KSC-5-250B N-(2-isoindolin-2-ylethyl)-4-[(mesitylsulfonylamino)methyl]benzamide cid_44601478
Type:
Small organic molecule
Emp. Form.:
C27H31N3O3S
Mol. Mass.:
477.618
SMILES:
Cc1cc(C)c(c(C)c1)S(=O)(=O)NCc1ccc(cc1)C(=O)NCCN1Cc2ccccc2C1
: