Target
Interleukin-8
Ligand
BDBM49106
Substrate
Meas. Tech.
SAR analysis of GM-Tri-DAP induced IL-8 secretion in MCF-7/NOD1 cells - Set 2
IC50
3430±686 nM
Citation
 PubChem, PC SAR analysis of GM-Tri-DAP induced IL-8 secretion in MCF-7/NOD1 cells - Set 2 PubChem Bioassay (2010)[AID] 
Target
Name:
Interleukin-8
Synonyms:
CXCL8 IL8_HUMAN interleukin 8 precursor
Type:
PROTEIN
Mol. Mass.:
11104.05
Organism:
Homo sapiens (Human)
Description:
ChEMBL_577736
Residue:
99
  
Inhibitor
Name:
BDBM49106
Synonyms:
7-[(E)-but-2-enyl]-3-methyl-8-(3-phenylpropylsulfanyl)purine-2,6-dione 7-[(E)-but-2-enyl]-3-methyl-8-(3-phenylpropylthio)xanthine SMR000015484 | cid_5310346
Type:
Small organic molecule
Emp. Form.:
C19H22N4O2S
Mol. Mass.:
370.469
SMILES:
C\C=C\Cn1c(SCCCc2ccccc2)nc2n(C)c(=O)[nH]c(=O)c12
: