Target
NADPH oxidase 1
Ligand
BDBM65841
Substrate
Meas. Tech.
Late stage results from the probe development effort to identify inhibitors of NOX1: HEK/293 IC50
IC50
1000±n/a nM
Citation
 PubChem, PC Late stage results from the probe development effort to identify inhibitors of NOX1: HEK/293 IC50 PubChem Bioassay (2010)[AID] 
Target
Name:
NADPH oxidase 1
Synonyms:
MOX-1 Mitogenic oxidase 1 NOH-1 NOX-1 NOX1_HUMAN
Type:
PROTEIN
Mol. Mass.:
64890.44
Organism:
Homo sapiens (Human)
Description:
ChEMBL_792877
Residue:
564
  
Inhibitor
Name:
BDBM65841
Synonyms:
2-(trifluoromethyl)-10H-phenothiazine cid_7082
Type:
Small organic molecule
Emp. Form.:
C13H8F3NS
Mol. Mass.:
267.27
SMILES:
FC(F)(F)c1ccc2Sc3ccccc3Nc2c1
: