Target
NADPH oxidase 1
Ligand
BDBM65838
Substrate
Meas. Tech.
Late stage results from the probe development effort to identify inhibitors of (NADPH oxidase 1) NOX1: Xanthine Oxidase
IC50
11100±n/a nM
Citation
 PubChem, PC Late stage results from the probe development effort to identify inhibitors of (NADPH oxidase 1) NOX1: Xanthine Oxidase PubChem Bioassay (2010)[AID] 
Target
Name:
NADPH oxidase 1
Synonyms:
MOX-1 Mitogenic oxidase 1 NOH-1 NOX-1 NOX1_HUMAN
Type:
PROTEIN
Mol. Mass.:
64890.44
Organism:
Homo sapiens (Human)
Description:
ChEMBL_792877
Residue:
564
  
Inhibitor
Name:
BDBM65838
Synonyms:
(2-piperidin-1-ylphenyl) 3-chloranyl-1-benzothiophene-2-carboxylate 3-chloro-1-benzothiophene-2-carboxylic acid [2-(1-piperidinyl)phenyl] ester SR-01000631630-1 | cid_2812902
Type:
Small organic molecule
Emp. Form.:
C20H18ClNO2S
Mol. Mass.:
371.88
SMILES:
Clc1c(sc2ccccc12)C(=O)Oc1ccccc1N1CCCCC1
: