Target
Glucose-6-phosphate 1-dehydrogenase
Ligand
BDBM43272
Substrate
Meas. Tech.
G6DPH counterscreen for TbHK1 inhibitors - Analogues series
IC50
>25000±n/a nM
Citation
 PubChem, PC G6DPH counterscreen for TbHK1 inhibitors - Analogues series PubChem Bioassay (2010)[AID] 
Target
Name:
Glucose-6-phosphate 1-dehydrogenase
Synonyms:
G6PD_LEUME zwf
Type:
Enzyme Catalytic Domain
Mol. Mass.:
54421.26
Organism:
Leuconostoc mesenteroides
Description:
gi_149631
Residue:
486
  
Inhibitor
Name:
BDBM43272
Synonyms:
4-chloranyl-2-[(4-methoxyphenyl)carbonylamino]benzoic acid 4-chloro-2-[(4-methoxybenzoyl)amino]benzoic acid MLS000663391 cid_1254149
Type:
Small organic molecule
Emp. Form.:
C15H12ClNO4
Mol. Mass.:
305.713
SMILES:
COc1ccc(cc1)C(=O)Nc1cc(Cl)ccc1C(O)=O
: