Target
Glucose-6-phosphate 1-dehydrogenase
Ligand
BDBM61934
Substrate
Meas. Tech.
G6DPH counterscreen for TbHK1 inhibitors - Analogues series
IC50
>25000±n/a nM
Citation
 PubChem, PC G6DPH counterscreen for TbHK1 inhibitors - Analogues series PubChem Bioassay (2010)[AID] 
Target
Name:
Glucose-6-phosphate 1-dehydrogenase
Synonyms:
G6PD_LEUME zwf
Type:
Enzyme Catalytic Domain
Mol. Mass.:
54421.26
Organism:
Leuconostoc mesenteroides
Description:
gi_149631
Residue:
486
  
Inhibitor
Name:
BDBM61934
Synonyms:
2-(3-keto-1,2-benzothiazol-2-yl)-N-[3-(trifluoromethyl)phenyl]acetamide 2-(3-oxo-1,2-benzothiazol-2-yl)-N-[3-(trifluoromethyl)phenyl]acetamide KUC104221N | cid_44623835
Type:
Small organic molecule
Emp. Form.:
C16H11F3N2O2S
Mol. Mass.:
352.331
SMILES:
FC(F)(F)c1cccc(NC(=O)Cn2sc3ccccc3c2=O)c1
: