Target
Glucose-6-phosphate 1-dehydrogenase
Ligand
BDBM61939
Substrate
Meas. Tech.
G6DPH counterscreen for TbHK1 inhibitors - Analogues series
IC50
>25000±n/a nM
Citation
 PubChem, PC G6DPH counterscreen for TbHK1 inhibitors - Analogues series PubChem Bioassay (2010)[AID] 
Target
Name:
Glucose-6-phosphate 1-dehydrogenase
Synonyms:
G6PD_LEUME zwf
Type:
Enzyme Catalytic Domain
Mol. Mass.:
54421.26
Organism:
Leuconostoc mesenteroides
Description:
gi_149631
Residue:
486
  
Inhibitor
Name:
BDBM61939
Synonyms:
5,6-bis(fluoranyl)-2-phenyl-1,2-benzothiazol-3-one 5,6-difluoro-2-phenyl-1,2-benzothiazol-3-one (2) KUC104549N | cid_44968081
Type:
Small organic molecule
Emp. Form.:
C13H7F2NOS
Mol. Mass.:
263.263
SMILES:
Fc1cc2sn(-c3ccccc3)c(=O)c2cc1F
: