Target
Glucose-6-phosphate 1-dehydrogenase
Ligand
BDBM61957
Substrate
Meas. Tech.
G6DPH counterscreen for TbHK1 inhibitors - Analogues series
IC50
>25000±n/a nM
Citation
 PubChem, PC G6DPH counterscreen for TbHK1 inhibitors - Analogues series PubChem Bioassay (2010)[AID] 
Target
Name:
Glucose-6-phosphate 1-dehydrogenase
Synonyms:
G6PD_LEUME zwf
Type:
Enzyme Catalytic Domain
Mol. Mass.:
54421.26
Organism:
Leuconostoc mesenteroides
Description:
gi_149631
Residue:
486
  
Inhibitor
Name:
BDBM61957
Synonyms:
3-(3-keto-1,2-benzothiazol-2-yl)-N-phenyl-propionamide 3-(3-oxidanylidene-1,2-benzothiazol-2-yl)-N-phenyl-propanamide KSC-09-135 cid_45254020
Type:
Small organic molecule
Emp. Form.:
C16H14N2O2S
Mol. Mass.:
298.36
SMILES:
O=C(CCn1sc2ccccc2c1=O)Nc1ccccc1
: