Target
Glucose-6-phosphate 1-dehydrogenase
Ligand
BDBM61980
Substrate
Meas. Tech.
G6DPH counterscreen for TbHK1 inhibitors - Analogues series
IC50
>25000±n/a nM
Citation
 PubChem, PC G6DPH counterscreen for TbHK1 inhibitors - Analogues series PubChem Bioassay (2010)[AID] 
Target
Name:
Glucose-6-phosphate 1-dehydrogenase
Synonyms:
G6PD_LEUME zwf
Type:
Enzyme Catalytic Domain
Mol. Mass.:
54421.26
Organism:
Leuconostoc mesenteroides
Description:
gi_149631
Residue:
486
  
Inhibitor
Name:
BDBM61980
Synonyms:
4-chloranyl-2-[(3-methoxyphenyl)carbonylamino]benzoic acid 4-chloro-2-[(3-methoxybenzoyl)amino]benzoic acid KSC-6-259 cid_2233523
Type:
Small organic molecule
Emp. Form.:
C15H12ClNO4
Mol. Mass.:
305.713
SMILES:
COc1cccc(c1)C(=O)Nc1cc(Cl)ccc1C(O)=O
: