Target
Glucose-6-phosphate 1-dehydrogenase
Ligand
BDBM61990
Substrate
Meas. Tech.
G6DPH counterscreen for TbHK1 inhibitors - Analogues series
IC50
>25000±n/a nM
Citation
 PubChem, PC G6DPH counterscreen for TbHK1 inhibitors - Analogues series PubChem Bioassay (2010)[AID] 
Target
Name:
Glucose-6-phosphate 1-dehydrogenase
Synonyms:
G6PD_LEUME zwf
Type:
Enzyme Catalytic Domain
Mol. Mass.:
54421.26
Organism:
Leuconostoc mesenteroides
Description:
gi_149631
Residue:
486
  
Inhibitor
Name:
BDBM61990
Synonyms:
KSC-6-266 N-(5-chloranyl-2-nitro-phenyl)-4-methoxy-benzamide N-(5-chloro-2-nitrophenyl)-4-methoxybenzamide | cid_46173040
Type:
Small organic molecule
Emp. Form.:
C14H11ClN2O4
Mol. Mass.:
306.701
SMILES:
COc1ccc(cc1)C(=O)Nc1cc(Cl)ccc1[N+]([O-])=O
: