Target
Glucose-6-phosphate 1-dehydrogenase
Ligand
BDBM62005
Substrate
Meas. Tech.
G6DPH counterscreen for TbHK1 inhibitors - Analogues series
IC50
>25000±n/a nM
Citation
 PubChem, PC G6DPH counterscreen for TbHK1 inhibitors - Analogues series PubChem Bioassay (2010)[AID] 
Target
Name:
Glucose-6-phosphate 1-dehydrogenase
Synonyms:
G6PD_LEUME zwf
Type:
Enzyme Catalytic Domain
Mol. Mass.:
54421.26
Organism:
Leuconostoc mesenteroides
Description:
gi_149631
Residue:
486
  
Inhibitor
Name:
BDBM62005
Synonyms:
1-hydroxy-5-(trifluoromethyl)-3H-2,1-benzoxaborole KSC-6-287 cid_11846116
Type:
Small organic molecule
Emp. Form.:
C8H6BF3O2
Mol. Mass.:
201.938
SMILES:
OB1OCc2cc(ccc12)C(F)(F)F
: