Target
Glucose-6-phosphate 1-dehydrogenase
Ligand
BDBM62012
Substrate
Meas. Tech.
G6DPH counterscreen for TbHK1 inhibitors - Analogues series
IC50
>25000±n/a nM
Citation
 PubChem, PC G6DPH counterscreen for TbHK1 inhibitors - Analogues series PubChem Bioassay (2010)[AID] 
Target
Name:
Glucose-6-phosphate 1-dehydrogenase
Synonyms:
G6PD_LEUME zwf
Type:
Enzyme Catalytic Domain
Mol. Mass.:
54421.26
Organism:
Leuconostoc mesenteroides
Description:
gi_149631
Residue:
486
  
Inhibitor
Name:
BDBM62012
Synonyms:
5-chloranyl-2-[(4-methoxyphenyl)carbamoyl]benzoic acid 5-chloro-2-[(4-methoxyphenyl)carbamoyl]benzoic acid KUC105925N | cid_46742336
Type:
Small organic molecule
Emp. Form.:
C15H12ClNO4
Mol. Mass.:
305.713
SMILES:
COc1ccc(NC(=O)c2ccc(Cl)cc2C(O)=O)cc1
: