Target
Glucose-6-phosphate 1-dehydrogenase
Ligand
BDBM62017
Substrate
Meas. Tech.
G6DPH counterscreen for TbHK1 inhibitors - Analogues series
IC50
>25000±n/a nM
Citation
 PubChem, PC G6DPH counterscreen for TbHK1 inhibitors - Analogues series PubChem Bioassay (2010)[AID] 
Target
Name:
Glucose-6-phosphate 1-dehydrogenase
Synonyms:
G6PD_LEUME zwf
Type:
Enzyme Catalytic Domain
Mol. Mass.:
54421.26
Organism:
Leuconostoc mesenteroides
Description:
gi_149631
Residue:
486
  
Inhibitor
Name:
BDBM62017
Synonyms:
2-acetamido-4-chloranyl-benzoic acid 2-acetamido-4-chlorobenzoic acid KUC105931N | cid_239963
Type:
Small organic molecule
Emp. Form.:
C9H8ClNO3
Mol. Mass.:
213.618
SMILES:
CC(=O)Nc1cc(Cl)ccc1C(O)=O
: