Target
Glucose-6-phosphate 1-dehydrogenase
Ligand
BDBM62020
Substrate
Meas. Tech.
G6DPH counterscreen for TbHK1 inhibitors - Analogues series
IC50
>25000±n/a nM
Citation
 PubChem, PC G6DPH counterscreen for TbHK1 inhibitors - Analogues series PubChem Bioassay (2010)[AID] 
Target
Name:
Glucose-6-phosphate 1-dehydrogenase
Synonyms:
G6PD_LEUME zwf
Type:
Enzyme Catalytic Domain
Mol. Mass.:
54421.26
Organism:
Leuconostoc mesenteroides
Description:
gi_149631
Residue:
486
  
Inhibitor
Name:
BDBM62020
Synonyms:
4-chloranyl-2-(1,3-oxazol-4-ylcarbonylamino)benzoic acid 4-chloro-2-(oxazole-4-carbonylamino)benzoic acid KSC-09-197 cid_46245555
Type:
Small organic molecule
Emp. Form.:
C11H7ClN2O4
Mol. Mass.:
266.637
SMILES:
OC(=O)c1ccc(Cl)cc1NC(=O)c1cocn1
: