Target
Glucose-6-phosphate 1-dehydrogenase
Ligand
BDBM62024
Substrate
Meas. Tech.
G6DPH counterscreen for TbHK1 inhibitors - Analogues series
IC50
>25000±n/a nM
Citation
 PubChem, PC G6DPH counterscreen for TbHK1 inhibitors - Analogues series PubChem Bioassay (2010)[AID] 
Target
Name:
Glucose-6-phosphate 1-dehydrogenase
Synonyms:
G6PD_LEUME zwf
Type:
Enzyme Catalytic Domain
Mol. Mass.:
54421.26
Organism:
Leuconostoc mesenteroides
Description:
gi_149631
Residue:
486
  
Inhibitor
Name:
BDBM62024
Synonyms:
4-chloranyl-2-[2-(4-methoxyphenyl)ethanoylamino]benzoic acid 4-chloro-2-[[2-(4-methoxyphenyl)acetyl]amino]benzoic acid KUC105993N | cid_839406
Type:
Small organic molecule
Emp. Form.:
C16H14ClNO4
Mol. Mass.:
319.74
SMILES:
COc1ccc(CC(=O)Nc2cc(Cl)ccc2C(O)=O)cc1
: