Target
Glucose-6-phosphate 1-dehydrogenase
Ligand
BDBM62057
Substrate
Meas. Tech.
G6DPH counterscreen for TbHK1 inhibitors - Analogues series
IC50
>25000±n/a nM
Citation
 PubChem, PC G6DPH counterscreen for TbHK1 inhibitors - Analogues series PubChem Bioassay (2010)[AID] 
Target
Name:
Glucose-6-phosphate 1-dehydrogenase
Synonyms:
G6PD_LEUME zwf
Type:
Enzyme Catalytic Domain
Mol. Mass.:
54421.26
Organism:
Leuconostoc mesenteroides
Description:
gi_149631
Residue:
486
  
Inhibitor
Name:
BDBM62057
Synonyms:
4-chloranyl-2-[(4-cyclopropylphenyl)carbonylamino]benzoic acid 4-chloro-2-[[(4-cyclopropylphenyl)-oxomethyl]amino]benzoic acid KUC106496N | cid_46856250
Type:
Small organic molecule
Emp. Form.:
C17H14ClNO3
Mol. Mass.:
315.751
SMILES:
OC(=O)c1ccc(Cl)cc1NC(=O)c1ccc(cc1)C1CC1
: