Target
Ion channel NompC
Ligand
BDBM46991
Substrate
Meas. Tech.
Late stage counterscreen for the probe development effort to identify selective agonists of the Transient Receptor Potential Channels 3 (TRPML3)
EC50
>29900±n/a nM
Citation
 PubChem, PC Late stage counterscreen for the probe development effort to identify selective agonists of the Transient Receptor Potential Channels 3 (TRPML3): fluorescence-based cell-based dose response assay for TRPN1 agonists. PubChem Bioassay (2010)[AID] 
Target
Name:
Ion channel NompC
Synonyms:
transient receptor potential cation channel, subfamily N, member 1
Type:
Enzyme Catalytic Domain
Mol. Mass.:
175824.78
Organism:
Danio rerio
Description:
Q7T1G6
Residue:
1614
  
Inhibitor
Name:
BDBM46991
Synonyms:
3-(4-chlorophenyl)-5-methyl-4-(2-tosylpyrazol-3-yl)isoxazole 3-(4-chlorophenyl)-5-methyl-4-[2-(4-methylphenyl)sulfonylpyrazol-3-yl]-1,2-oxazole MLS001111122 cid_2745583
Type:
Small organic molecule
Emp. Form.:
C20H16ClN3O3S
Mol. Mass.:
413.877
SMILES:
Cc1onc(c1-c1ccnn1S(=O)(=O)c1ccc(C)cc1)-c1ccc(Cl)cc1
: