Target
Inward rectifier potassium channel 2
Ligand
BDBM65854
Substrate
Meas. Tech.
Confirmation dose response assay for compounds that inhibit/block inward-rectifying potassium ion channel Kir2.1
IC50
48339±36544 nM
Citation
 PubChem, PC Confirmation dose response assay for compounds that inhibit/block inward-rectifying potassium ion channel Kir2.1 PubChem Bioassay (2010)[AID] 
Target
Name:
Inward rectifier potassium channel 2
Synonyms:
Irk1 Kcnj2 | inward rectifier potassium channel 2
Type:
Enzyme Catalytic Domain
Mol. Mass.:
48383.35
Organism:
Mus musculus
Description:
gi_6680530
Residue:
428
  
Inhibitor
Name:
BDBM65854
Synonyms:
4-[[4-ethyl-5-(phenoxymethyl)-1,2,4-triazol-3-yl]sulfanylmethyl]benzenecarbonitrile 4-[[[4-ethyl-5-(phenoxymethyl)-1,2,4-triazol-3-yl]thio]methyl]benzonitrile SMR000046276 | cid_665176
Type:
Small organic molecule
Emp. Form.:
C19H18N4OS
Mol. Mass.:
350.437
SMILES:
CCn1c(COc2ccccc2)nnc1SCc1ccc(cc1)C#N
: