Target
Inward rectifier potassium channel 2
Ligand
BDBM65872
Substrate
Meas. Tech.
Confirmation dose response assay for compounds that inhibit/block inward-rectifying potassium ion channel Kir2.1
IC50
24626±18083 nM
Citation
 PubChem, PC Confirmation dose response assay for compounds that inhibit/block inward-rectifying potassium ion channel Kir2.1 PubChem Bioassay (2010)[AID] 
Target
Name:
Inward rectifier potassium channel 2
Synonyms:
Irk1 Kcnj2 | inward rectifier potassium channel 2
Type:
Enzyme Catalytic Domain
Mol. Mass.:
48383.35
Organism:
Mus musculus
Description:
gi_6680530
Residue:
428
  
Inhibitor
Name:
BDBM65872
Synonyms:
1-[(4-fluorobenzyl)amino]-3-(4-methylphenoxy)propan-2-ol 1-[(4-fluorophenyl)methylamino]-3-(4-methylphenoxy)propan-2-ol SMR000590574 | cid_4213523
Type:
Small organic molecule
Emp. Form.:
C17H20FNO2
Mol. Mass.:
289.3446
SMILES:
Cc1ccc(OCC(O)CNCc2ccc(F)cc2)cc1
: