Target
Inward rectifier potassium channel 2
Ligand
BDBM65874
Substrate
Meas. Tech.
Confirmation dose response assay for compounds that inhibit/block inward-rectifying potassium ion channel Kir2.1
IC50
21477±3516 nM
Citation
 PubChem, PC Confirmation dose response assay for compounds that inhibit/block inward-rectifying potassium ion channel Kir2.1 PubChem Bioassay (2010)[AID] 
Target
Name:
Inward rectifier potassium channel 2
Synonyms:
Irk1 Kcnj2 | inward rectifier potassium channel 2
Type:
Enzyme Catalytic Domain
Mol. Mass.:
48383.35
Organism:
Mus musculus
Description:
gi_6680530
Residue:
428
  
Inhibitor
Name:
BDBM65874
Synonyms:
2-[[2-[(2-hydroxy-5-methyl-benzyl)amino]ethylamino]methyl]-4-methyl-phenol 4-methyl-2-[[2-[(5-methyl-2-oxidanyl-phenyl)methylamino]ethylamino]methyl]phenol SMR000841359 | cid_3627083
Type:
Small organic molecule
Emp. Form.:
C18H24N2O2
Mol. Mass.:
300.3954
SMILES:
Cc1ccc(O)c(CNCCNCc2cc(C)ccc2O)c1
: