Target
Potassium voltage-gated channel subfamily KQT member 2
Ligand
BDBM65886
Substrate
Meas. Tech.
Mode of action assay-Automated electrophysiology assay of compounds that potentiate KCNQ2 potassium channel
EC50
7250±3140 nM
Citation
 PubChem, PC Mode of action assay-Automated electrophysiology assay of compounds that potentiate KCNQ2 potassium channel PubChem Bioassay (2010)[AID] 
Target
Name:
Potassium voltage-gated channel subfamily KQT member 2
Synonyms:
KCNQ2_RAT Voltage-gated potassium channel subunit Kv7.2 | potassium voltage-gated channel, KQT-like subfamily, member 2
Type:
PROTEIN
Mol. Mass.:
93984.01
Organism:
Rattus norvegicus
Description:
EBI_100117
Residue:
852
  
Inhibitor
Name:
BDBM65886
Synonyms:
1-(4-phenoxyphenyl)-3-(3-pyridinyl)thiourea 1-(4-phenoxyphenyl)-3-pyridin-3-yl-thiourea MLS001181201 cid_1870641
Type:
Small organic molecule
Emp. Form.:
C18H15N3OS
Mol. Mass.:
321.396
SMILES:
S=C(Nc1ccc(Oc2ccccc2)cc1)Nc1cccnc1
: