Target
Potassium voltage-gated channel subfamily KQT member 2
Ligand
BDBM65890
Substrate
Meas. Tech.
Mode of action assay-Automated electrophysiology assay of compounds that potentiate KCNQ2 potassium channel
EC50
3020±810 nM
Citation
 PubChem, PC Mode of action assay-Automated electrophysiology assay of compounds that potentiate KCNQ2 potassium channel PubChem Bioassay (2010)[AID] 
Target
Name:
Potassium voltage-gated channel subfamily KQT member 2
Synonyms:
KCNQ2_RAT Voltage-gated potassium channel subunit Kv7.2 | potassium voltage-gated channel, KQT-like subfamily, member 2
Type:
PROTEIN
Mol. Mass.:
93984.01
Organism:
Rattus norvegicus
Description:
EBI_100117
Residue:
852
  
Inhibitor
Name:
BDBM65890
Synonyms:
5-chloranyl-2-[(4-methylphenyl)methylsulfonyl]-N-(5-propyl-1,3,4-thiadiazol-2-yl)pyrimidine-4-carboxamide 5-chloro-2-[(4-methylphenyl)methylsulfonyl]-N-(5-propyl-1,3,4-thiadiazol-2-yl)-4-pyrimidinecarboxamide MLS001116147 cid_16014339
Type:
Small organic molecule
Emp. Form.:
C18H18ClN5O3S2
Mol. Mass.:
451.95
SMILES:
CCCc1nnc(NC(=O)c2nc(ncc2Cl)S(=O)(=O)Cc2ccc(C)cc2)s1
: