Target
Potassium voltage-gated channel subfamily KQT member 2
Ligand
BDBM65902
Substrate
Meas. Tech.
Mode of action assay-Automated electrophysiology assay of compounds that potentiate KCNQ2 potassium channel
EC50
1830±260 nM
Citation
 PubChem, PC Mode of action assay-Automated electrophysiology assay of compounds that potentiate KCNQ2 potassium channel PubChem Bioassay (2010)[AID] 
Target
Name:
Potassium voltage-gated channel subfamily KQT member 2
Synonyms:
KCNQ2_RAT Voltage-gated potassium channel subunit Kv7.2 | potassium voltage-gated channel, KQT-like subfamily, member 2
Type:
PROTEIN
Mol. Mass.:
93984.01
Organism:
Rattus norvegicus
Description:
EBI_100117
Residue:
852
  
Inhibitor
Name:
BDBM65902
Synonyms:
5-chloranyl-2-[(3-methylphenyl)methylsulfonyl]-N-(5-methylsulfanyl-1,3,4-thiadiazol-2-yl)pyrimidine-4-carboxamide 5-chloro-2-[(3-methylphenyl)methylsulfonyl]-N-(5-methylsulfanyl-1,3,4-thiadiazol-2-yl)pyrimidine-4-carboxamide MLS001116199 cid_16447016
Type:
Small organic molecule
Emp. Form.:
C16H14ClN5O3S3
Mol. Mass.:
455.962
SMILES:
CSc1nnc(NC(=O)c2nc(ncc2Cl)S(=O)(=O)Cc2cccc(C)c2)s1
: