Target
Muscarinic acetylcholine receptor M1
Ligand
BDBM65921
Substrate
Meas. Tech.
Discovery of Novel Allosteric Modulators of the M1 Muscarinic Receptor: PAM Calcium Assay SAR
EC50
3070±n/a nM
Citation
 PubChem, PC Discovery of Novel Allosteric Modulators of the M1 Muscarinic Receptor: PAM Calcium Assay SAR PubChem Bioassay (2010)[AID] 
Target
Name:
Muscarinic acetylcholine receptor M1
Synonyms:
ACM1_RAT Chrm-1 cholinergic receptor, muscarinic 1
Type:
Enzyme Catalytic Domain
Mol. Mass.:
51390.46
Organism:
RAT
Description:
P08482
Residue:
460
  
Inhibitor
Name:
BDBM65921
Synonyms:
2-[1-[2-fluoro-5-(1H-pyrazol-5-yl)benzyl]indol-3-yl]sulfonyl-N-(5-methylisoxazol-3-yl)acetamide 2-[1-[[2-fluoro-5-(1H-pyrazol-5-yl)phenyl]methyl]indol-3-yl]sulfonyl-N-(5-methyl-1,2-oxazol-3-yl)acetamide VU0405653-1 | cid_44475956
Type:
Small organic molecule
Emp. Form.:
C24H20FN5O4S
Mol. Mass.:
493.51
SMILES:
Cc1cc(NC(=O)CS(=O)(=O)c2cn(Cc3cc(ccc3F)-c3cc[nH]n3)c3ccccc23)no1
: