Target
1,5-anhydro-D-fructose reductase
Ligand
BDBM268883
Substrate
Meas. Tech.
Fatty Acid Synthase Keto-reductase Domain (FASN KR) Inhibition
pH
7.5±n/a
Temperature
298.15±n/a K
IC50
417±n/a nM
Comments
extracted
Citation
 Connolly, PJLu, T Imidazolin-5-one derivative useful as FASN inhibitors for the treatment of cancer US Patent  US9718813 Publication Date 8/1/2017 
Target
Name:
1,5-anhydro-D-fructose reductase
Synonyms:
AF reductase AKR1CL2 AKRDC1 Aldo-keto reductase family 1 member E2 | LoopADR
Type:
Enzyme Catalytic Domain
Mol. Mass.:
36595.42
Organism:
Homo sapiens (Human)
Description:
Q96JD6
Residue:
320
  
Inhibitor
Name:
BDBM268883
Synonyms:
(4RS)-1-(((R)-1-(cyclopropanecarbonyl)pyrrolidin-3-yl)methyl)-4-methyl-2-(4-(1-methyl-1H-indazol-5-yl)phenyl)-4-phenyl-1H-imidazol-5(4H)-one US9718813, Compound 6
Type:
Small organic molecule
Emp. Form.:
C33H33N5O2
Mol. Mass.:
531.6474
SMILES:
Cn1ncc2cc(ccc12)-c1ccc(cc1)C1=NC(C)(C(=O)N1C[C@@H]1CCN(C1)C(=O)C1CC1)c1ccccc1
: