Target
Potassium voltage-gated channel subfamily KQT member 2
Ligand
BDBM65934
Substrate
Meas. Tech.
Dose response of Retigabine-insensitive compounds that potentiate KCNQ2 potassium channel
EC50
9140±2750 nM
Citation
 PubChem, PC Dose response of Retigabine-insensitive compounds that potentiate KCNQ2 potassium channel PubChem Bioassay (2011)[AID] 
Target
Name:
Potassium voltage-gated channel subfamily KQT member 2
Synonyms:
KCNQ2_RAT Voltage-gated potassium channel subunit Kv7.2 | potassium voltage-gated channel, KQT-like subfamily, member 2
Type:
PROTEIN
Mol. Mass.:
93984.01
Organism:
Rattus norvegicus
Description:
EBI_100117
Residue:
852
  
Inhibitor
Name:
BDBM65934
Synonyms:
1-(3-fluoranyl-4-methyl-phenyl)-3-pyridin-3-yl-urea 1-(3-fluoro-4-methylphenyl)-3-(3-pyridinyl)urea VU0414987-1 | cid_17087659
Type:
Small organic molecule
Emp. Form.:
C13H12FN3O
Mol. Mass.:
245.2523
SMILES:
Cc1ccc(NC(=O)Nc2cccnc2)cc1F
: