Target
Potassium voltage-gated channel subfamily KQT member 2
Ligand
BDBM65948
Substrate
Meas. Tech.
Dose response of Retigabine-insensitive compounds that potentiate KCNQ2 potassium channel
EC50
6610±1870 nM
Citation
 PubChem, PC Dose response of Retigabine-insensitive compounds that potentiate KCNQ2 potassium channel PubChem Bioassay (2011)[AID] 
Target
Name:
Potassium voltage-gated channel subfamily KQT member 2
Synonyms:
KCNQ2_RAT Voltage-gated potassium channel subunit Kv7.2 | potassium voltage-gated channel, KQT-like subfamily, member 2
Type:
PROTEIN
Mol. Mass.:
93984.01
Organism:
Rattus norvegicus
Description:
EBI_100117
Residue:
852
  
Inhibitor
Name:
BDBM65948
Synonyms:
1-(6-bromanyl-5-methyl-pyridin-3-yl)-3-(3-fluorophenyl)urea 1-(6-bromo-5-methyl-3-pyridyl)-3-(3-fluorophenyl)urea VU0417939-1 | cid_45489575
Type:
Small organic molecule
Emp. Form.:
C13H11BrFN3O
Mol. Mass.:
324.148
SMILES:
Cc1cc(NC(=O)Nc2cccc(F)c2)cnc1Br
: