Target
Tyrosine-protein phosphatase non-receptor type 22
Ligand
BDBM46245
Substrate
Meas. Tech.
SAR LYP1 Fluorescent Assay using pCAP substrate for In Vitro dose response studies - Set 2
IC50
3170±n/a nM
Citation
 PubChem, PC SAR LYP1 Fluorescent Assay using pCAP substrate for In Vitro dose response studies - Set 2 PubChem Bioassay (2010)[AID] 
Target
Name:
Tyrosine-protein phosphatase non-receptor type 22
Synonyms:
3.1.3.48 LyP Lymphoid phosphatase (Lyp) PEST-domain phosphatase PTPN22 Tyrosine-protein phosphatase non-receptor type 22 (LYP) | tyrosine-protein phosphatase non-receptor type 22 isoform 1
Type:
Mol. Mass.:
91712.31
Organism:
Homo sapiens (Human)
Description:
Q9Y2R2
Residue:
807
  
Inhibitor
Name:
BDBM46245
Synonyms:
4-keto-5-methyl-2-[(E)-2-(4-methyl-3-nitro-phenyl)vinyl]-3H-thieno[2,3-d]pyrimidine-6-carboxylic acid 5-methyl-2-[(E)-2-(4-methyl-3-nitrophenyl)ethenyl]-4-oxo-3H-thieno[2,3-d]pyrimidine-6-carboxylic acid cid_8853383
Type:
Small organic molecule
Emp. Form.:
C17H13N3O5S
Mol. Mass.:
371.367
SMILES:
Cc1c(sc2nc(C=Cc3ccc(C)c(c3)[N+]([O-])=O)[nH]c(=O)c12)C(O)=O
: