Target
Tyrosine-protein phosphatase non-receptor type 22
Ligand
BDBM65961
Substrate
Meas. Tech.
SAR LYP1 Fluorescent Assay using pCAP substrate for In Vitro dose response studies - Set 2
IC50
4100±n/a nM
Citation
 PubChem, PC SAR LYP1 Fluorescent Assay using pCAP substrate for In Vitro dose response studies - Set 2 PubChem Bioassay (2010)[AID] 
Target
Name:
Tyrosine-protein phosphatase non-receptor type 22
Synonyms:
3.1.3.48 LyP Lymphoid phosphatase (Lyp) PEST-domain phosphatase PTPN22 Tyrosine-protein phosphatase non-receptor type 22 (LYP) | tyrosine-protein phosphatase non-receptor type 22 isoform 1
Type:
Mol. Mass.:
91712.31
Organism:
Homo sapiens (Human)
Description:
Q9Y2R2
Residue:
807
  
Inhibitor
Name:
BDBM65961
Synonyms:
2-[2-[(E)-[[4-[2-(4-chloroanilino)-1,3-thiazol-4-yl]benzoyl]hydrazinylidene]methyl]phenoxy]acetic acid 2-[2-[(E)-[[4-[2-[(4-chlorophenyl)amino]-1,3-thiazol-4-yl]phenyl]carbonylhydrazinylidene]methyl]phenoxy]ethanoic acid MLS-0435411.0001 | cid_9595040
Type:
Small organic molecule
Emp. Form.:
C25H19ClN4O4S
Mol. Mass.:
506.961
SMILES:
OC(=O)COc1ccccc1\C=N\NC(=O)c1ccc(cc1)-c1csc(Nc2ccc(Cl)cc2)n1
: