Target
Tyrosine-protein phosphatase non-receptor type 22
Ligand
BDBM54770
Substrate
Meas. Tech.
SAR LYP1 Fluorescent Assay using pCAP substrate for In Vitro dose response studies - Set 2
IC50
1860±n/a nM
Citation
 PubChem, PC SAR LYP1 Fluorescent Assay using pCAP substrate for In Vitro dose response studies - Set 2 PubChem Bioassay (2010)[AID] 
Target
Name:
Tyrosine-protein phosphatase non-receptor type 22
Synonyms:
3.1.3.48 LyP Lymphoid phosphatase (Lyp) PEST-domain phosphatase PTPN22 Tyrosine-protein phosphatase non-receptor type 22 (LYP) | tyrosine-protein phosphatase non-receptor type 22 isoform 1
Type:
Mol. Mass.:
91712.31
Organism:
Homo sapiens (Human)
Description:
Q9Y2R2
Residue:
807
  
Inhibitor
Name:
BDBM54770
Synonyms:
3-[[(E)-3-[4-(4-bromobenzyl)oxy-3-ethoxy-phenyl]-2-cyano-acryloyl]amino]benzoic acid 3-[[(E)-3-[4-[(4-bromophenyl)methoxy]-3-ethoxyphenyl]-2-cyano-1-oxoprop-2-enyl]amino]benzoic acid MLS001172658 cid_2354598
Type:
Small organic molecule
Emp. Form.:
C26H21BrN2O5
Mol. Mass.:
521.359
SMILES:
CCOc1cc(\C=C(/C#N)C(=O)Nc2cccc(c2)C(O)=O)ccc1OCc1ccc(Br)cc1
: