Target
Tyrosine-protein phosphatase non-receptor type 22
Ligand
BDBM46239
Substrate
Meas. Tech.
SAR LYP1 Fluorescent Assay using OMFP substrate for In Vitro dose response studies - Set 2
IC50
65500±n/a nM
Citation
 PubChem, PC SAR LYP1 Fluorescent Assay using OMFP substrate for In Vitro dose response studies - Set 2 PubChem Bioassay (2010)[AID] 
Target
Name:
Tyrosine-protein phosphatase non-receptor type 22
Synonyms:
3.1.3.48 LyP Lymphoid phosphatase (Lyp) PEST-domain phosphatase PTPN22 Tyrosine-protein phosphatase non-receptor type 22 (LYP) | tyrosine-protein phosphatase non-receptor type 22 isoform 1
Type:
Mol. Mass.:
91712.31
Organism:
Homo sapiens (Human)
Description:
Q9Y2R2
Residue:
807
  
Inhibitor
Name:
BDBM46239
Synonyms:
4-[[4-[(E)-2-cyano-2-(3-fluorophenyl)ethenyl]phenoxy]methyl]benzoic acid MLS-0412108.0001 | cid_2230291
Type:
Small organic molecule
Emp. Form.:
C23H16FNO3
Mol. Mass.:
373.3764
SMILES:
OC(=O)c1ccc(COc2ccc(\C=C(\C#N)c3cccc(F)c3)cc2)cc1
: