Target
Tyrosine-protein phosphatase non-receptor type 22
Ligand
BDBM46264
Substrate
Meas. Tech.
SAR LYP1 Fluorescent Assay using OMFP substrate for In Vitro dose response studies - Set 2
IC50
>100000±n/a nM
Citation
 PubChem, PC SAR LYP1 Fluorescent Assay using OMFP substrate for In Vitro dose response studies - Set 2 PubChem Bioassay (2010)[AID] 
Target
Name:
Tyrosine-protein phosphatase non-receptor type 22
Synonyms:
3.1.3.48 LyP Lymphoid phosphatase (Lyp) PEST-domain phosphatase PTPN22 Tyrosine-protein phosphatase non-receptor type 22 (LYP) | tyrosine-protein phosphatase non-receptor type 22 isoform 1
Type:
Mol. Mass.:
91712.31
Organism:
Homo sapiens (Human)
Description:
Q9Y2R2
Residue:
807
  
Inhibitor
Name:
BDBM46264
Synonyms:
3-[2-azaspiro[5.5]undecan-2-yl-(1-cyclopentyl-1,2,3,4-tetrazol-5-yl)methyl]-6-methyl-1H-quinolin-2-one 3-[2-azaspiro[5.5]undecan-2-yl-(1-cyclopentyltetrazol-5-yl)methyl]-6-methyl-1H-quinolin-2-one MLS-0412204.0001 | cid_3182456
Type:
Small organic molecule
Emp. Form.:
C27H36N6O
Mol. Mass.:
460.6143
SMILES:
Cc1ccc2[nH]c(=O)c(cc2c1)C(N1CCCC2(CCCCC2)C1)c1nnnn1C1CCCC1
: