Target
S-ribosylhomocysteine lyase
Ligand
BDBM65976
Substrate
Meas. Tech.
Luminescence Microorganism-Based Dose Retest to Identify Modulators of the AI-2 Quorum Sensing System
EC50
2559±n/a nM
Citation
 PubChem, PC Luminescence Microorganism-Based Dose Retest to Identify Modulators of the AI-2 Quorum Sensing System PubChem Bioassay (2010)[AID] 
Target
Name:
S-ribosylhomocysteine lyase
Synonyms:
LuxS
Type:
Enzyme Catalytic Domain
Mol. Mass.:
15564.06
Organism:
Vibrio harveyi
Description:
B0LUE4
Residue:
140
  
Inhibitor
Name:
BDBM65976
Synonyms:
MLS000099320 N-(6-methyl-2-pyridyl)-4-phenoxy-benzenesulfonamide N-(6-methylpyridin-2-yl)-4-phenoxybenzenesulfonamide cid_801216
Type:
Small organic molecule
Emp. Form.:
C18H16N2O3S
Mol. Mass.:
340.396
SMILES:
Cc1cccc(NS(=O)(=O)c2ccc(Oc3ccccc3)cc2)n1
: