Target
60S ribosomal protein L19-A
Ligand
BDBM44877
Substrate
Meas. Tech.
Dose Response of TOR pathway GFP-fusion proteins in Saccharomyes cerevisiae specifically RPL19A based on MLPCN hits
EC50
5003±n/a nM
Citation
 PubChem, PC Dose Response of TOR pathway GFP-fusion proteins in Saccharomyes cerevisiae specifically RPL19A based on MLPCN hits PubChem Bioassay (2010)[AID] 
Target
Name:
60S ribosomal protein L19-A
Synonyms:
RL19A_YEAST RPL23A | YL14A
Type:
Enzyme Catalytic Domain
Mol. Mass.:
21739.62
Organism:
Saccharomyces cerevisiae
Description:
gi_536029
Residue:
189
  
Inhibitor
Name:
BDBM44877
Synonyms:
2-Cyano-2-[(2,4-dimethyl-phenyl)-hydrazono]-thioacetamide 2-cyano-2-[(2,4-dimethylphenyl)hydrazinylidene]ethanethioamide MLS000554383 cid_915258
Type:
Small organic molecule
Emp. Form.:
C11H12N4S
Mol. Mass.:
232.305
SMILES:
Cc1ccc(NN=C(C#N)C(N)=S)c(C)c1
: