Target
60S ribosomal protein L19-A
Ligand
BDBM65991
Substrate
Meas. Tech.
Dose Response of TOR pathway GFP-fusion proteins in Saccharomyes cerevisiae specifically RPL19A based on MLPCN hits
EC50
10810±n/a nM
Citation
 PubChem, PC Dose Response of TOR pathway GFP-fusion proteins in Saccharomyes cerevisiae specifically RPL19A based on MLPCN hits PubChem Bioassay (2010)[AID] 
Target
Name:
60S ribosomal protein L19-A
Synonyms:
RL19A_YEAST RPL23A | YL14A
Type:
Enzyme Catalytic Domain
Mol. Mass.:
21739.62
Organism:
Saccharomyces cerevisiae
Description:
gi_536029
Residue:
189
  
Inhibitor
Name:
BDBM65991
Synonyms:
(cyclopentylideneamino) N-(4-chlorophenyl)carbamate N-(4-chlorophenyl)carbamic acid (cyclopentylideneamino) ester cid_789466
Type:
Small organic molecule
Emp. Form.:
C12H13ClN2O2
Mol. Mass.:
252.697
SMILES:
Clc1ccc(-[#7]-[#6](=O)-[#8]\[#7]=[#6]-2\[#6]-[#6]-[#6]-[#6]-2)cc1
: