Target
60S ribosomal protein L19-A
Ligand
BDBM66001
Substrate
Meas. Tech.
Dose Response of TOR pathway GFP-fusion proteins in Saccharomyes cerevisiae specifically RPL19A based on MLPCN hits
EC50
11390±n/a nM
Citation
 PubChem, PC Dose Response of TOR pathway GFP-fusion proteins in Saccharomyes cerevisiae specifically RPL19A based on MLPCN hits PubChem Bioassay (2010)[AID] 
Target
Name:
60S ribosomal protein L19-A
Synonyms:
RL19A_YEAST RPL23A | YL14A
Type:
Enzyme Catalytic Domain
Mol. Mass.:
21739.62
Organism:
Saccharomyces cerevisiae
Description:
gi_536029
Residue:
189
  
Inhibitor
Name:
BDBM66001
Synonyms:
(4Z)-4-[(1,3-diphenyl-4-pyrazolyl)methylidene]-3-methyl-1H-pyrazol-5-one (4Z)-4-[(1,3-diphenylpyrazol-4-yl)methylidene]-3-methyl-1H-pyrazol-5-one SMR000260965 | cid_6258408
Type:
Small organic molecule
Emp. Form.:
C20H16N4O
Mol. Mass.:
328.3672
SMILES:
C=c1[nH][nH]c(=O)c1=Cc1cn(nc1-c1ccccc1)-c1ccccc1
: