Target
60S ribosomal protein L19-A
Ligand
BDBM66003
Substrate
Meas. Tech.
Dose Response of TOR pathway GFP-fusion proteins in Saccharomyes cerevisiae specifically RPL19A based on MLPCN hits
EC50
4648±n/a nM
Citation
 PubChem, PC Dose Response of TOR pathway GFP-fusion proteins in Saccharomyes cerevisiae specifically RPL19A based on MLPCN hits PubChem Bioassay (2010)[AID] 
Target
Name:
60S ribosomal protein L19-A
Synonyms:
RL19A_YEAST RPL23A | YL14A
Type:
Enzyme Catalytic Domain
Mol. Mass.:
21739.62
Organism:
Saccharomyces cerevisiae
Description:
gi_536029
Residue:
189
  
Inhibitor
Name:
BDBM66003
Synonyms:
(5E)-1-(4-fluorobenzyl)-5-(2-thenylidene)barbituric acid 1-(4-Fluoro-benzyl)-5-[1-thiophen-2-yl-meth-(E)-ylidene]-pyrimidine-2,4,6-trione SMR000218269 | cid_5418979
Type:
Small organic molecule
Emp. Form.:
C16H11FN2O3S
Mol. Mass.:
330.334
SMILES:
Fc1ccc(CN2C(=O)NC(=O)\C(=C/c3cccs3)C2=O)cc1
: