Target
General amino acid permease AGP1
Ligand
BDBM34183
Substrate
Meas. Tech.
Dose Response of TOR pathway GFP-fusion proteins in Saccharomyes cerevisiae specifically AGP1 based on MLPCN hits
EC50
1379±n/a nM
Citation
 PubChem, PC Dose Response of TOR pathway GFP-fusion proteins in Saccharomyes cerevisiae specifically AGP1 based on MLPCN hits PubChem Bioassay (2010)[AID] 
Target
Name:
General amino acid permease AGP1
Synonyms:
AGP1 Agp1p
Type:
Enzyme Catalytic Domain
Mol. Mass.:
69674.09
Organism:
Saccharomyces cerevisiae S288c
Description:
gi_85666113
Residue:
633
  
Inhibitor
Name:
BDBM34183
Synonyms:
2-[4-phenyl-6-(trifluoromethyl)pyrimidin-2-yl]sulfonylacetic acid ethyl ester MLS000049112 cid_1151859 ethyl 2-[4-phenyl-6-(trifluoromethyl)pyrimidin-2-yl]sulfonylethanoate | ethyl {[4-phenyl-6-(trifluoromethyl)-2-pyrimidinyl]sulfonyl}acetate
Type:
Small organic molecule
Emp. Form.:
C15H13F3N2O4S
Mol. Mass.:
374.335
SMILES:
CCOC(=O)CS(=O)(=O)c1nc(cc(n1)C(F)(F)F)-c1ccccc1
: