Target
General amino acid permease AGP1
Ligand
BDBM60229
Substrate
Meas. Tech.
Dose Response of TOR pathway GFP-fusion proteins in Saccharomyes cerevisiae specifically AGP1 based on MLPCN hits
EC50
1939±n/a nM
Citation
 PubChem, PC Dose Response of TOR pathway GFP-fusion proteins in Saccharomyes cerevisiae specifically AGP1 based on MLPCN hits PubChem Bioassay (2010)[AID] 
Target
Name:
General amino acid permease AGP1
Synonyms:
AGP1 Agp1p
Type:
Enzyme Catalytic Domain
Mol. Mass.:
69674.09
Organism:
Saccharomyces cerevisiae S288c
Description:
gi_85666113
Residue:
633
  
Inhibitor
Name:
BDBM60229
Synonyms:
MLS000568342 N-[[(4-propoxybenzoyl)amino]carbamothioyl]propanamide N-[[(4-propoxyphenyl)carbonylamino]carbamothioyl]propanamide SMR000177383 | cid_1728272
Type:
Small organic molecule
Emp. Form.:
C14H19N3O3S
Mol. Mass.:
309.384
SMILES:
CCCOc1ccc(cc1)C(=O)NNC(=S)NC(=O)CC
: