Target
Citrate synthase, peroxisomal [1-24]
Ligand
BDBM66033
Substrate
Meas. Tech.
Dose Response of TOR pathway GFP-fusion proteins in Saccharomyes cerevisiae specifically CIT2 based on MLPCN hits
EC50
>33000±n/a nM
Citation
 PubChem, PC Dose Response of TOR pathway GFP-fusion proteins in Saccharomyes cerevisiae specifically CIT2 based on MLPCN hits PubChem Bioassay (2010)[AID] 
Target
Name:
Citrate synthase, peroxisomal [1-24]
Synonyms:
CISY2_YEAST citrate synthase 2
Type:
Enzyme Catalytic Domain
Mol. Mass.:
2731.97
Organism:
Saccharomyces cerevisiae
Description:
gi_171229
Residue:
24
  
Inhibitor
Name:
BDBM66033
Synonyms:
(cyclopentylideneamino) N-phenylcarbamate N-phenylcarbamic acid (cyclopentylideneamino) ester cid_789467 | cyclopentanone O-(anilinocarbonyl)oxime
Type:
Small organic molecule
Emp. Form.:
C12H14N2O2
Mol. Mass.:
218.2518
SMILES:
O=[#6](-[#7]-c1ccccc1)-[#8]\[#7]=[#6]-1\[#6]-[#6]-[#6]-[#6]-1
: