Target
Citrate synthase, peroxisomal [1-24]
Ligand
BDBM53605
Substrate
Meas. Tech.
Dose Response of TOR pathway GFP-fusion proteins in Saccharomyes cerevisiae specifically CIT2 based on MLPCN hits
EC50
>33000±n/a nM
Citation
 PubChem, PC Dose Response of TOR pathway GFP-fusion proteins in Saccharomyes cerevisiae specifically CIT2 based on MLPCN hits PubChem Bioassay (2010)[AID] 
Target
Name:
Citrate synthase, peroxisomal [1-24]
Synonyms:
CISY2_YEAST citrate synthase 2
Type:
Enzyme Catalytic Domain
Mol. Mass.:
2731.97
Organism:
Saccharomyces cerevisiae
Description:
gi_171229
Residue:
24
  
Inhibitor
Name:
BDBM53605
Synonyms:
5-[bis(chloranyl)-(1-phenyl-1,2,3,4-tetrazol-5-yl)methyl]-1-phenyl-1,2,3,4-tetrazole 5-[dichloro-(1-phenyltetrazol-5-yl)methyl]-1-phenyl-tetrazole MLS000561802 cid_3090522
Type:
Small organic molecule
Emp. Form.:
C15H10Cl2N8
Mol. Mass.:
373.2
SMILES:
ClC(Cl)(c1nnnn1-c1ccccc1)c1nnnn1-c1ccccc1
: